Target
Mitogen-activated protein kinase 14
Ligand
BDBM50053410
Substrate
Meas. Tech.
ChEMBL_562697 (CHEMBL1012732)
IC50
79±n/a nM
Citation
 Thaher, BAKoch, PSchattel, VLaufer, S Role of the hydrogen bonding heteroatom-Lys53 interaction between the p38alpha mitogen-activated protein (MAP) kinase and pyridinyl-substituted 5-membered heterocyclic ring inhibitors. J Med Chem 52:2613-7 (2009)  
Target
Name:
Mitogen-activated protein kinase 14
Synonyms:
CSAID-binding protein CSBP1 CSPB1 MAP kinase 14 MAP kinase p38 alpha MAPK14 MK14_HUMAN Mitogen-activated protein kinase p38 alpha Stress-activated protein kinase 2a | p38 MAP kinase alpha/beta
Type:
Serine/threonine-protein kinase
Mol. Mass.:
41286.76
Organism:
Homo sapiens (Human)
Description:
Q16539
Residue:
360
  
Inhibitor
Name:
BDBM50053410
Synonyms:
4-(4-Fluorophenyl)-5-(pyridin-4-yl)-1H-imidazole CHEMBL63135
Type:
Small organic molecule
Emp. Form.:
C14H10FN3
Mol. Mass.:
239.2477
SMILES:
Fc1ccc(cc1)-c1[nH]cnc1-c1ccncc1
: