Target
Vitamin D3 receptor
Ligand
BDBM50293274
Substrate
Meas. Tech.
ChEMBL_562894 (CHEMBL1018831)
EC50
0.69±n/a nM
Citation
 Laverny, GPenna, GUskokovic, MMarczak, SMaehr, HJankowski, PCeailles, CVouros, PSmith, BRobinson, MReddy, GSAdorini, L Synthesis and anti-inflammatory properties of 1alpha,25-dihydroxy-16-ene-20-cyclopropyl-24-oxo-vitamin D3, a hypocalcemic, stable metabolite of 1alpha,25-dihydroxy-16-ene-20-cyclopropyl-vitamin D3. J Med Chem 52:2204-13 (2009)  
Target
Name:
Vitamin D3 receptor
Synonyms:
1,25-dihydroxyvitamin D3 receptor Nuclear receptor subfamily 1 group I member 1 VDR | VDR_HUMAN
Type:
Protein
Mol. Mass.:
48288.72
Organism:
Homo sapiens (Human)
Description:
P11473
Residue:
427
  
Inhibitor
Name:
BDBM50293274
Synonyms:
1alpha,25(OH)2-24-oxo-16-ene-20-cyclopropyl-vitamin D3 | CHEMBL492749
Type:
Small organic molecule
Emp. Form.:
C28H40O4
Mol. Mass.:
440.6148
SMILES:
CC(C)(O)C(=O)CCC1(CC1)C1=CC[C@H]2\C(CCC[C@]12C)=C\C=C1\C[C@@H](O)C[C@H](O)C1=C
: