Target
Adenosine receptor A1
Ligand
BDBM50267396
Substrate
Meas. Tech.
ChEMBL_562991 (CHEMBL1015328)
Ki
1.6±n/a nM
Citation
 Franchetti, PCappellacci, LVita, PPetrelli, RLavecchia, AKachler, SKlotz, KNMarabese, ILuongo, LMaione, SGrifantini, M N6-Cycloalkyl- and N6-bicycloalkyl-C5'(C2')-modified adenosine derivatives as high-affinity and selective agonists at the human A1 adenosine receptor with antinociceptive effects in mice. J Med Chem 52:2393-406 (2009)  
Target
Name:
Adenosine receptor A1
Synonyms:
A1 adenosine receptor (hA1) AA1R_HUMAN ADORA1 Adenosine A1-receptor Adenosine receptor A1 (hA1) | Adenosine transporter (AdT)
Type:
G Protein-Coupled Receptor (GPCR)
Mol. Mass.:
36520.92
Organism:
Homo sapiens (Human)
Description:
P30542
Residue:
326
  
Inhibitor
Name:
BDBM50267396
Synonyms:
2-Chloro-N6-(+/-)-endo-norbornyl-9H-(5-chloro-5-deoxy-beta-D-ribofuranosyl)adenine | CHEMBL514541
Type:
Small organic molecule
Emp. Form.:
C17H21Cl2N5O3
Mol. Mass.:
414.286
SMILES:
O[C@@H]1[C@@H](CCl)O[C@H]([C@@H]1O)n1cnc2c(NC3CC4CCC3C4)nc(Cl)nc12
: