Target
Adenosine receptor A1
Ligand
BDBM50267475
Substrate
Meas. Tech.
ChEMBL_562991 (CHEMBL1015328)
Ki
9.1±n/a nM
Citation
 Franchetti, PCappellacci, LVita, PPetrelli, RLavecchia, AKachler, SKlotz, KNMarabese, ILuongo, LMaione, SGrifantini, M N6-Cycloalkyl- and N6-bicycloalkyl-C5'(C2')-modified adenosine derivatives as high-affinity and selective agonists at the human A1 adenosine receptor with antinociceptive effects in mice. J Med Chem 52:2393-406 (2009)  
Target
Name:
Adenosine receptor A1
Synonyms:
A1 adenosine receptor (hA1) AA1R_HUMAN ADORA1 Adenosine A1-receptor Adenosine receptor A1 (hA1) | Adenosine transporter (AdT)
Type:
G Protein-Coupled Receptor (GPCR)
Mol. Mass.:
36520.92
Organism:
Homo sapiens (Human)
Description:
P30542
Residue:
326
  
Inhibitor
Name:
BDBM50267475
Synonyms:
CHEMBL477665 | N6-(+/-)-endo-Norbornyl-9H-(2-C-methyl-5-chloro-5-deoxy-beta-D-ribofuranosyl)adenine
Type:
Small organic molecule
Emp. Form.:
C18H24ClN5O3
Mol. Mass.:
393.868
SMILES:
C[C@@]1(O)[C@H](O)[C@@H](CCl)O[C@H]1n1cnc2c(NC3CC4CCC3C4)ncnc12
: