Target
Adenosine receptor A2a
Ligand
BDBM50267478
Substrate
Meas. Tech.
ChEMBL_562992 (CHEMBL1015329)
Ki
2190±n/a nM
Citation
 Franchetti, PCappellacci, LVita, PPetrelli, RLavecchia, AKachler, SKlotz, KNMarabese, ILuongo, LMaione, SGrifantini, M N6-Cycloalkyl- and N6-bicycloalkyl-C5'(C2')-modified adenosine derivatives as high-affinity and selective agonists at the human A1 adenosine receptor with antinociceptive effects in mice. J Med Chem 52:2393-406 (2009)  
Target
Name:
Adenosine receptor A2a
Synonyms:
A2A adenosine receptor (hA2A) ADENOSINE A2 ADORA2 Adenosine A2A receptor (A2AAR)
Type:
G Protein-Coupled Receptor (GPCR)
Mol. Mass.:
44716.46
Organism:
Homo sapiens (Human)
Description:
P29274
Residue:
412
  
Inhibitor
Name:
BDBM50267478
Synonyms:
2-Chloro-N6-cyclopentyl-9H-[5-deoxy-5-(2-fluorophenylthio)-beta-D-ribofuranosyl]adenine | CHEMBL477667
Type:
Small organic molecule
Emp. Form.:
C21H23ClFN5O3S
Mol. Mass.:
479.955
SMILES:
O[C@@H]1[C@@H](CSc2ccccc2F)O[C@H]([C@@H]1O)n1cnc2c(NC3CCCC3)nc(Cl)nc12
: