Target
Cannabinoid receptor 2
Ligand
BDBM50267728
Substrate
Meas. Tech.
ChEMBL_563054 (CHEMBL1011884)
IC50
>10000±n/a nM
Citation
 Vachal, PFletcher, JMFong, TMHuang, CCLao, JXiao, JCShen, CPStrack, AMShearman, LStribling, SChen, RZFrassetto, ATong, XWang, JBall, RGTsou, NNHickey, GJThompson, DFFaidley, TDNicolich, SAchanfuo-Yeboah, JHora, DFHale, JJHagmann, WK 1-Sulfonyl-4-acylpiperazines as selective cannabinoid-1 receptor (CB1R) inverse agonists for the treatment of obesity. J Med Chem 52:2550-8 (2009)  
Target
Name:
Cannabinoid receptor 2
Synonyms:
CANNABINOID CB2 CB2 CB2B CNR2_HUMAN Cannabinoid CB2 receptor Cannabinoid receptor 2 (CB2R) | hCB2
Type:
G Protein-Coupled Receptor (GPCR)
Mol. Mass.:
39690.94
Organism:
Homo sapiens (Human)
Description:
P34972
Residue:
360
  
Inhibitor
Name:
BDBM50267728
Synonyms:
(4-(3-(1H-1,2,4-triazol-1-yl)-5-(trifluoromethyl)phenylsulfonyl)piperazin-1-yl)((1R,2R)-2-(4-(trifluoromethyl)phenyl)cyclopropyl)methanone | CHEMBL487294
Type:
Small organic molecule
Emp. Form.:
C24H21F6N5O3S
Mol. Mass.:
573.511
SMILES:
FC(F)(F)c1ccc(cc1)[C@@H]1C[C@H]1C(=O)N1CCN(CC1)S(=O)(=O)c1cc(cc(c1)C(F)(F)F)-n1cncn1
: