Target
Cannabinoid receptor 1
Ligand
BDBM50267821
Substrate
Meas. Tech.
ChEMBL_563053 (CHEMBL1011883)
EC50
5±n/a nM
Citation
 Vachal, PFletcher, JMFong, TMHuang, CCLao, JXiao, JCShen, CPStrack, AMShearman, LStribling, SChen, RZFrassetto, ATong, XWang, JBall, RGTsou, NNHickey, GJThompson, DFFaidley, TDNicolich, SAchanfuo-Yeboah, JHora, DFHale, JJHagmann, WK 1-Sulfonyl-4-acylpiperazines as selective cannabinoid-1 receptor (CB1R) inverse agonists for the treatment of obesity. J Med Chem 52:2550-8 (2009)  
Target
Name:
Cannabinoid receptor 1
Synonyms:
CANN6 CB-R CNR CNR1_HUMAN Cannabinoid receptor Cannabinoid receptor 1 (brain)
Type:
G Protein-Coupled Receptor (GPCR)
Mol. Mass.:
52868.96
Organism:
Homo sapiens (Human)
Description:
P21554
Residue:
472
  
Inhibitor
Name:
BDBM50267821
Synonyms:
CHEMBL445204 | cyclopropyl(4-(3,5-dichlorophenylsulfonyl)piperazin-1-yl)methanone
Type:
Small organic molecule
Emp. Form.:
C14H16Cl2N2O3S
Mol. Mass.:
363.259
SMILES:
Clc1cc(Cl)cc(c1)S(=O)(=O)N1CCN(CC1)C(=O)C1CC1
: