Target
5-hydroxytryptamine receptor 7
Ligand
BDBM50216047
Substrate
Meas. Tech.
ChEMBL_563397 (CHEMBL959382)
Ki
158±n/a nM
Citation
 Medina, RASallander, JBenhamú, BPorras, ECampillo, MPardo, LLópez-Rodríguez, ML Synthesis of new serotonin 5-HT7 receptor ligands. Determinants of 5-HT7/5-HT1A receptor selectivity. J Med Chem 52:2384-92 (2009)  
Target
Name:
5-hydroxytryptamine receptor 7
Synonyms:
5-HT-7 5-HT7 5-HT7S 5HT7 HTR7 | Serotonin receptor 7
Type:
G Protein-Coupled Receptor (GPCR)
Mol. Mass.:
53573.08
Organism:
Homo sapiens (Human)
Description:
P34969
Residue:
479
  
Inhibitor
Name:
BDBM50216047
Synonyms:
2-(4-(4-phenyl-1-piperazinyl)butyl)-1-isoindolinone CHEMBL393492
Type:
Small organic molecule
Emp. Form.:
C23H29N3O2
Mol. Mass.:
379.4953
SMILES:
COc1ccccc1N1CCN(CCCCN2Cc3ccccc3C2=O)CC1
: