Target
Mitogen-activated protein kinase 9
Ligand
BDBM50277910
Substrate
Meas. Tech.
ChEMBL_501729 (CHEMBL985009)
IC50
17±n/a nM
Citation
 Humphries, PSLafontaine, JAAgree, CSAlexander, DChen, PDo, QQLi, LYLunney, EARajapakse, RJSiegel, KTimofeevski, SLWang, TWilhite, DM Synthesis and SAR of 4-substituted-2-aminopyrimidines as novel c-Jun N-terminal kinase (JNK) inhibitors. Bioorg Med Chem Lett 19:2099-102 (2009)  
Target
Name:
Mitogen-activated protein kinase 9
Synonyms:
JNK-55 JNK2/JNK3 MK09_HUMAN Mitogen-activated protein kinase 8/9 SAPK1A c-Jun N-terminal kinase 2 | c-Jun N-terminal kinase 2 (JNK2)
Type:
Enzyme
Mol. Mass.:
48131.49
Organism:
Homo sapiens (Human)
Description:
JNK-2 was purchased from Upstate Cell Signaling Solutions (formerly Upstate Biotechnology).
Residue:
424
  
Inhibitor
Name:
BDBM50277910
Synonyms:
4-(4-(2-(cyclopentylamino)pyrimidin-4-yl)-1H-pyrazol-3-yl)cyclohexanol | CHEMBL507249
Type:
Small organic molecule
Emp. Form.:
C18H25N5O
Mol. Mass.:
327.424
SMILES:
O[C@H]1CC[C@@H](CC1)c1[nH]ncc1-c1ccnc(NC2CCCC2)n1
: