Target
72 kDa type IV collagenase
Ligand
BDBM50259007
Substrate
Meas. Tech.
ChEMBL_500226 (CHEMBL980693)
IC50
1.3±n/a nM
Citation
 Hopper, DWVera, MDHow, DSabatini, JXiang, JSIpek, MThomason, JHu, YFeyfant, EWang, QGeorgiadis, KEReifenberg, ESheldon, RTKeohan, CCMajumdar, MKMorris, EASkotnicki, JSum, PE Synthesis and biological evaluation of ((4-keto)-phenoxy)methyl biphenyl-4-sulfonamides: a class of potent aggrecanase-1 inhibitors. Bioorg Med Chem Lett 19:2487-91 (2009)  
Target
Name:
72 kDa type IV collagenase
Synonyms:
72 kDa gelatinase CLG4A Gelatinase A (MMP-2) MMP2_HUMAN Matrix metalloproteinase-2 (MMP 2) Matrix metalloproteinases 2 (MMP-2) | TBE-1
Type:
Enzyme
Mol. Mass.:
73870.36
Organism:
Homo sapiens (Human)
Description:
P08253
Residue:
660
  
Inhibitor
Name:
BDBM50259007
Synonyms:
(R)-2-(4'-((4-isobutyrylphenoxy)methyl)biphenyl-4-ylsulfonamido)-3-methylbutanoic acid N-({4'-[(4-isobutyrylphenoxy)methyl]biphenyl-4-yl}sulfonyl)-D-valine
Type:
Small organic molecule
Emp. Form.:
C28H31NO6S
Mol. Mass.:
509.614
SMILES:
CC(C)[C@@H](NS(=O)(=O)c1ccc(cc1)-c1ccc(COc2ccc(cc2)C(=O)C(C)C)cc1)C(O)=O
: