Target
5-hydroxytryptamine receptor 5A
Ligand
BDBM50232152
Substrate
Meas. Tech.
ChEMBL_563491 (CHEMBL961039)
Ki
>10000±n/a nM
Citation
 Herth, MMKramer, VPiel, MPalner, MRiss, PJKnudsen, GMRösch, F Synthesis and in vitro affinities of various MDL 100907 derivatives as potential 18F-radioligands for 5-HT2A receptor imaging with PET. Bioorg Med Chem 17:2989-3002 (2009)  
Target
Name:
5-hydroxytryptamine receptor 5A
Synonyms:
5-HT-5 5-hydroxytryptamine receptor 5 (5-HT5) 5HT5A_HUMAN Serotonin (5-HT) receptor | Serotonin receptor 5A
Type:
Enzyme
Mol. Mass.:
40266.25
Organism:
Homo sapiens (Human)
Description:
P47898
Residue:
357
  
Inhibitor
Name:
BDBM50232152
Synonyms:
(1-(4-fluorophenethyl)piperidin-4-yl)(3-(2-fluoroethoxy)-2-methoxyphenyl)methanol CHEMBL402143
Type:
Small organic molecule
Emp. Form.:
C23H29F2NO3
Mol. Mass.:
405.4781
SMILES:
COc1c(OCCF)cccc1C(O)C1CCN(CCc2ccc(F)cc2)CC1
: