Target
5-hydroxytryptamine receptor 7
Ligand
BDBM50267555
Substrate
Meas. Tech.
ChEMBL_563493 (CHEMBL961041)
Ki
>10000±n/a nM
Citation
 Herth, MMKramer, VPiel, MPalner, MRiss, PJKnudsen, GMRösch, F Synthesis and in vitro affinities of various MDL 100907 derivatives as potential 18F-radioligands for 5-HT2A receptor imaging with PET. Bioorg Med Chem 17:2989-3002 (2009)  
Target
Name:
5-hydroxytryptamine receptor 7
Synonyms:
5-HT-7 5-HT7 5-HT7S 5HT7 HTR7 | Serotonin receptor 7
Type:
G Protein-Coupled Receptor (GPCR)
Mol. Mass.:
53573.08
Organism:
Homo sapiens (Human)
Description:
P34969
Residue:
479
  
Inhibitor
Name:
BDBM50267555
Synonyms:
(3-(2-Fluoroethoxy)-2-methoxyphenyl)-(1-(2-p-methoxyphenylethyl)-piperidine-4-yl)-methanol | CHEMBL490633
Type:
Small organic molecule
Emp. Form.:
C24H32FNO4
Mol. Mass.:
417.5136
SMILES:
COc1ccc(CCN2CCC(CC2)C(O)c2cccc(OCCF)c2OC)cc1
: