Target
Alpha-1B adrenergic receptor
Ligand
BDBM50267508
Substrate
Meas. Tech.
ChEMBL_563503 (CHEMBL961051)
Ki
550±n/a nM
Citation
 Herth, MMKramer, VPiel, MPalner, MRiss, PJKnudsen, GMRösch, F Synthesis and in vitro affinities of various MDL 100907 derivatives as potential 18F-radioligands for 5-HT2A receptor imaging with PET. Bioorg Med Chem 17:2989-3002 (2009)  
Target
Name:
Alpha-1B adrenergic receptor
Synonyms:
ADA1B_HUMAN Adrenergic alpha1B Adrenergic receptor alpha Alpha 1B-adrenoreceptor | Alpha-1B adrenergic receptor
Type:
Enzyme
Mol. Mass.:
56862.13
Organism:
Homo sapiens (Human)
Description:
P35368
Residue:
520
  
Inhibitor
Name:
BDBM50267508
Synonyms:
4-(3-(2-Fluoroethoxy)-2-methoxy-benzoyl)-1-(2-p-fluorophenylethyl)-piperidine | CHEMBL516088
Type:
Small organic molecule
Emp. Form.:
C23H27F2NO3
Mol. Mass.:
403.4622
SMILES:
COc1c(OCCF)cccc1C(=O)C1CCN(CCc2ccc(F)cc2)CC1
: