Target
Alpha-2C adrenergic receptor
Ligand
BDBM50267554
Substrate
Meas. Tech.
ChEMBL_563479 (CHEMBL961027)
Ki
154±n/a nM
Citation
 Herth, MMKramer, VPiel, MPalner, MRiss, PJKnudsen, GMRösch, F Synthesis and in vitro affinities of various MDL 100907 derivatives as potential 18F-radioligands for 5-HT2A receptor imaging with PET. Bioorg Med Chem 17:2989-3002 (2009)  
Target
Name:
Alpha-2C adrenergic receptor
Synonyms:
ADA2C_HUMAN ADRA2L2 Adrenergic alpha2C Adrenergic receptor alpha Alpha-2 adrenergic receptor subtype C4 Alpha-2C adrenoreceptor | adrenergic, alpha-2C-, receptor [Homo sapiens]
Type:
Enzyme
Mol. Mass.:
49552.32
Organism:
Homo sapiens (Human)
Description:
P18825
Residue:
462
  
Inhibitor
Name:
BDBM50267554
Synonyms:
4-(3-(2-Fluoroethoxy)-2-methoxy-benzoyl)-1-(2-p-toluylethyl)-piperidine | CHEMBL490632
Type:
Small organic molecule
Emp. Form.:
C24H30FNO3
Mol. Mass.:
399.4983
SMILES:
COc1c(OCCF)cccc1C(=O)C1CCN(CCc2ccc(C)cc2)CC1
: