Target
5-hydroxytryptamine receptor 2C
Ligand
BDBM50232152
Substrate
Meas. Tech.
ChEMBL_563477 (CHEMBL961025)
Ki
71±n/a nM
Citation
 Herth, MMKramer, VPiel, MPalner, MRiss, PJKnudsen, GMRösch, F Synthesis and in vitro affinities of various MDL 100907 derivatives as potential 18F-radioligands for 5-HT2A receptor imaging with PET. Bioorg Med Chem 17:2989-3002 (2009)  
Target
Name:
5-hydroxytryptamine receptor 2C
Synonyms:
5-HT-2C 5-HT2C-INI 5-HTR2C 5-hydroxytryptamine receptor 2C (5-HT-2C) 5HT-1C HTR1C Serotonin (5-HT3) receptor Serotonin Receptor 2C
Type:
G Protein-Coupled Receptor (GPCR)
Mol. Mass.:
51836.79
Organism:
Homo sapiens (Human)
Description:
P28335
Residue:
458
  
Inhibitor
Name:
BDBM50232152
Synonyms:
(1-(4-fluorophenethyl)piperidin-4-yl)(3-(2-fluoroethoxy)-2-methoxyphenyl)methanol CHEMBL402143
Type:
Small organic molecule
Emp. Form.:
C23H29F2NO3
Mol. Mass.:
405.4781
SMILES:
COc1c(OCCF)cccc1C(O)C1CCN(CCc2ccc(F)cc2)CC1
: