Target
5-hydroxytryptamine receptor 1D
Ligand
BDBM50267510
Substrate
Meas. Tech.
ChEMBL_563487 (CHEMBL961035)
Ki
1440±n/a nM
Citation
 Herth, MMKramer, VPiel, MPalner, MRiss, PJKnudsen, GMRösch, F Synthesis and in vitro affinities of various MDL 100907 derivatives as potential 18F-radioligands for 5-HT2A receptor imaging with PET. Bioorg Med Chem 17:2989-3002 (2009)  
Target
Name:
5-hydroxytryptamine receptor 1D
Synonyms:
5-HT-1D 5-HT1D 5HT1D_HUMAN HTR1DA Serotonin (5-HT) receptor | Serotonin Receptor 1D
Type:
G Protein-Coupled Receptor (GPCR)
Mol. Mass.:
41920.63
Organism:
Homo sapiens (Human)
Description:
Receptor binding assays were performed using human clone stably expressed in CHO cells.
Residue:
377
  
Inhibitor
Name:
BDBM50267510
Synonyms:
(3-(2-Fluoroethoxy)-2-methoxyphenyl)-(1-(2-p-toluylphenylethyl)-piperidine-4-yl)-methanol | CHEMBL476839
Type:
Small organic molecule
Emp. Form.:
C24H32FNO3
Mol. Mass.:
401.5142
SMILES:
COc1c(OCCF)cccc1C(O)C1CCN(CCc2ccc(C)cc2)CC1
: