Target
5-hydroxytryptamine receptor 3A
Ligand
BDBM50267509
Substrate
Meas. Tech.
ChEMBL_563490 (CHEMBL961038)
Ki
>10000±n/a nM
Citation
 Herth, MMKramer, VPiel, MPalner, MRiss, PJKnudsen, GMRösch, F Synthesis and in vitro affinities of various MDL 100907 derivatives as potential 18F-radioligands for 5-HT2A receptor imaging with PET. Bioorg Med Chem 17:2989-3002 (2009)  
Target
Name:
5-hydroxytryptamine receptor 3A
Synonyms:
5-HT-3 5-HT3A 5-hydroxytryptamine receptor 3 (5-HT3) 5-hydroxytryptamine receptor 3A (5HT3A) 5HT3R HTR3A Serotonin 3 receptor (5HT3) Serotonin-gated ion channel receptor | Serotonin-gated ion channel receptor 3
Type:
Protein
Mol. Mass.:
55283.27
Organism:
Homo sapiens (Human)
Description:
P46098
Residue:
478
  
Inhibitor
Name:
BDBM50267509
Synonyms:
(3-(2-Fluorethoxy)-2-methoxyphenyl)-(1-(2-p-nitrophenylethyl)-piperidine-4-yl)-methanol | CHEMBL476838
Type:
Small organic molecule
Emp. Form.:
C23H29FN2O5
Mol. Mass.:
432.4852
SMILES:
COc1c(OCCF)cccc1C(O)C1CCN(CCc2ccc(cc2)[N+]([O-])=O)CC1
: