Target
Acetylcholine-binding protein
Ligand
BDBM50267844
Substrate
Meas. Tech.
ChEMBL_563557 (CHEMBL961844)
Ki
63.1±n/a nM
Citation
 Ulens, CAkdemir, AJongejan, Avan Elk, RBertrand, SPerrakis, ALeurs, RSmit, ABSixma, TKBertrand, Dde Esch, IJ Use of acetylcholine binding protein in the search for novel alpha7 nicotinic receptor ligands. In silico docking, pharmacological screening, and X-ray analysis. J Med Chem 52:2372-83 (2009)  
Target
Name:
Acetylcholine-binding protein
Synonyms:
ACHP_LYMST Acetylcholine Binding protein Acetylcholine-binding protein (Ls-AchBP) | AchBP
Type:
Mol. Mass.:
26055.52
Organism:
Lymnaea stagnalis
Description:
Soluble acetylcholine receptor
Residue:
229
  
Inhibitor
Name:
BDBM50267844
Synonyms:
3-(10,11-Dihydro-5H-dibenzo[a,d]cyclohepten-5-yloxy)-8,8-dimethyl-8-azonia-bicyclo[3.2.1]octane | CHEMBL490843
Type:
Small organic molecule
Emp. Form.:
C24H30NO
Mol. Mass.:
348.5006
SMILES:
C[N+]1(C)C2CCC1CC(C2)OC1c2ccccc2CCc2ccccc12
: