Target
Dual specificity calcium/calmodulin-dependent 3',5'-cyclic nucleotide phosphodiesterase 1B
Ligand
BDBM50259060
Substrate
Meas. Tech.
ChEMBL_500709 (CHEMBL966925)
IC50
>10000±n/a nM
Citation
 Deninno, MPAndrews, MBell, ASChen, YEller-Zarbo, CEshelby, NEtienne, JBMoore, DEPalmer, MJVisser, MSYu, LJZavadoski, WJMichael Gibbs, E The discovery of potent, selective, and orally bioavailable PDE9 inhibitors as potential hypoglycemic agents. Bioorg Med Chem Lett 19:2537-41 (2009)  
Target
Name:
Dual specificity calcium/calmodulin-dependent 3',5'-cyclic nucleotide phosphodiesterase 1B
Synonyms:
63 kDa Cam-PDE Calcium/calmodulin-dependent 3',5'-cyclic nucleotide phosphodiesterase 1B PDE1B PDE1B_HUMAN Phosphodiesterase 1B Phosphodiesterase Type 1 (PDE1B) | Phosphodiesterase, PDE1/PDE5
Type:
Enzyme
Mol. Mass.:
61366.51
Organism:
Homo sapiens (Human)
Description:
Residue:
536
  
Inhibitor
Name:
BDBM50259060
Synonyms:
CHEMBL466475 | N-[(1R,2S)2-(3-Isopropyl-7-oxo-6,7-dihydro-1H-pyrazolo[4,3-d]pyrimidin-5-ylmethyl)-cyclohex-1-yl]-2-pyrrolidin-1-yl-acetamide
Type:
Small organic molecule
Emp. Form.:
C21H32N6O2
Mol. Mass.:
400.5178
SMILES:
CC(C)c1[nH]nc2c1nc(C[C@@H]1CCCC[C@H]1NC(=O)CN1CCCC1)[nH]c2=O
: