Target
cAMP-specific 3',5'-cyclic phosphodiesterase 7B
Ligand
BDBM50259057
Substrate
Meas. Tech.
ChEMBL_500740 (CHEMBL970519)
IC50
>10000±n/a nM
Citation
 Deninno, MPAndrews, MBell, ASChen, YEller-Zarbo, CEshelby, NEtienne, JBMoore, DEPalmer, MJVisser, MSYu, LJZavadoski, WJMichael Gibbs, E The discovery of potent, selective, and orally bioavailable PDE9 inhibitors as potential hypoglycemic agents. Bioorg Med Chem Lett 19:2537-41 (2009)  
Target
Name:
cAMP-specific 3',5'-cyclic phosphodiesterase 7B
Synonyms:
3',5'-cyclic phosphodiesterase PDE7B_HUMAN Phosphodiesterase 7B (PDE7B) | cAMP-specific 3',5'-cyclic phosphodiesterase 7B
Type:
Enzyme
Mol. Mass.:
51842.76
Organism:
Homo sapiens (Human)
Description:
Q9NP56
Residue:
450
  
Inhibitor
Name:
BDBM50259057
Synonyms:
3-isopropyl-5-(2-(2-morpholinoethoxy)benzyl)-1H-pyrazolo[4,3-d]pyrimidin-7(6H)-one | CHEMBL466068
Type:
Small organic molecule
Emp. Form.:
C21H27N5O3
Mol. Mass.:
397.4708
SMILES:
CC(C)c1[nH]nc2c1nc(Cc1ccccc1OCCN1CCOCC1)[nH]c2=O
: