Target
Fructose-1,6-bisphosphatase 1
Ligand
BDBM50277613
Substrate
Meas. Tech.
ChEMBL_502048 (CHEMBL981259)
IC50
900±n/a nM
Citation
 Dang, QBrown, BSLiu, YRydzewski, RMRobinson, EDvan Poelje, PDReddy, MRErion, MD Fructose-1,6-bisphosphatase inhibitors. 1. Purine phosphonic acids as novel AMP mimics. J Med Chem 52:2880-98 (2009)  
Target
Name:
Fructose-1,6-bisphosphatase 1
Synonyms:
D-fructose-1,6-bisphosphate 1-phosphohydrolase 1 FBP FBPase 1 Fructose-1,6-bisphosphatase 1 | Fructose-1,6-bisphosphatase 1 (FBPase)
Type:
Protein
Mol. Mass.:
36843.58
Organism:
Homo sapiens (Human)
Description:
Liver FBPase (P09467)
Residue:
338
  
Inhibitor
Name:
BDBM50277613
Synonyms:
CHEMBL484332 | {5-[6-Amino-9-(3-chloro-2,2-dimethyl-propyl)-9H-purin-8-yl]-furan-2-yl}-phosphonic Acid
Type:
Small organic molecule
Emp. Form.:
C14H17ClN5O4P
Mol. Mass.:
385.743
SMILES:
CC(C)(CCl)Cn1c(nc2c(N)ncnc12)-c1ccc(o1)P(O)(O)=O
: