Target
Glycogen phosphorylase, muscle form
Ligand
BDBM50277565
Substrate
Meas. Tech.
ChEMBL_502059 (CHEMBL981270)
EC50
>100000±n/a nM
Citation
 Dang, QBrown, BSLiu, YRydzewski, RMRobinson, EDvan Poelje, PDReddy, MRErion, MD Fructose-1,6-bisphosphatase inhibitors. 1. Purine phosphonic acids as novel AMP mimics. J Med Chem 52:2880-98 (2009)  
Target
Name:
Glycogen phosphorylase, muscle form
Synonyms:
Glycogen Phosphorylase (PYGM) Glycogen phosphorylase, muscle form PYGM | PYGM_RABIT
Type:
Enzyme
Mol. Mass.:
97296.32
Organism:
Oryctolagus cuniculus (rabbit)
Description:
Phosphorylation of Ser-15 converts phosphorylase B (unphosphorylated) to phosphorylase A.
Residue:
843
  
Inhibitor
Name:
BDBM50277565
Synonyms:
5-(6-amino-9-neopentyl-9H-purin-8-yl)furan-2-ylphosphonic acid {5-[6-Amino-9-(2,2-dimethyl-propyl)-9H-purin-8-yl]-furan-2-yl}-phosphonic Acid
Type:
Small organic molecule
Emp. Form.:
C14H18N5O4P
Mol. Mass.:
351.2976
SMILES:
CC(C)(C)Cn1c(nc2c(N)ncnc12)-c1ccc(o1)P(O)(O)=O
: