Target
Protein mono-ADP-ribosyltransferase PARP3 [R100H]
Ligand
BDBM27533
Substrate
Meas. Tech.
ChEMBL_501487 (CHEMBL984126)
Kd
70±n/a nM
Citation
 Lehtiö, LJemth, ASCollins, RLoseva, OJohansson, AMarkova, NHammarström, MFlores, AHolmberg-Schiavone, LWeigelt, JHelleday, TSchüler, HKarlberg, T Structural basis for inhibitor specificity in human poly(ADP-ribose) polymerase-3. J Med Chem 52:3108-11 (2009)  
Target
Name:
Protein mono-ADP-ribosyltransferase PARP3 [R100H]
Synonyms:
(ARTD3 or PARP3) ADPRT3 Human diphtheria toxin-like ADP-ribosyltransferase (ARTD3 or PARP3) PARP3_HUMAN Poly [ADP-ribose] polymerase 3 (PARP-3) | Poly(ADP-ribose) polymerase-3 (ARTD3/PARP3)
Type:
PROTEIN
Mol. Mass.:
60071.85
Organism:
Homo sapiens (Human)
Description:
Q9Y6F1[R100H]
Residue:
533
  
Inhibitor
Name:
BDBM27533
Synonyms:
4-(3-(1,4-diazepane-1-carbonyl)-4-fluorobenzyl)phthalazin-1(2H)-one 4-[[3-(1,4-Diazepane-1-carbonyl)-4-fluorophenyl]methyl]-2Hphthalazin-1-one CHEMBL380648 KU-0058948
Type:
Small organic molecule
Emp. Form.:
C21H21FN4O2
Mol. Mass.:
380.4154
SMILES:
Fc1ccc(Cc2n[nH]c(=O)c3ccccc23)cc1C(=O)N1CCCNCC1
: