Target
Cyclin-dependent kinase 2
Ligand
BDBM5541
Substrate
Meas. Tech.
ChEMBL_501549 (CHEMBL986816)
IC50
2300±n/a nM
Citation
 Lu, YShi, TWang, YYang, HYan, XLuo, XJiang, HZhu, W Halogen bonding--a novel interaction for rational drug design? J Med Chem 52:2854-62 (2009)  
Target
Name:
Cyclin-dependent kinase 2
Synonyms:
CDK2 CDK2_HUMAN Cell division protein kinase 2 Protein cereblon/Cyclin-dependent kinase 2 | p33 protein kinase
Type:
Enzyme Subunit
Mol. Mass.:
33938.17
Organism:
Homo sapiens (Human)
Description:
P24941
Residue:
298
  
Inhibitor
Name:
BDBM5541
Synonyms:
4-{[6-(cyclohexylmethoxy)-9H-purin-2-yl]amino}phenol CHEMBL340813 | O6-Cyclohexylmethylguanine deriv. 25
Type:
Small organic molecule
Emp. Form.:
C18H21N5O2
Mol. Mass.:
339.3916
SMILES:
Oc1ccc(Nc2nc(OCC3CCCCC3)c3[nH]cnc3n2)cc1
: