Target
Carbonic anhydrase 2
Ligand
BDBM50259373
Substrate
Meas. Tech.
ChEMBL_498934 (CHEMBL976241)
Ki
20±n/a nM
Citation
 Kasimoğullari, RBülbül, MGünhan, HGüleryüz, H Effects of new 5-amino-1,3,4-thiadiazole-2-sulfonamide derivatives on human carbonic anhydrase isozymes. Bioorg Med Chem 17:3295-301 (2009)  
Target
Name:
Carbonic anhydrase 2
Synonyms:
CA-II CAC Carbonate dehydratase II Carbonic anhydrase 2 (CA-II) Carbonic anhydrase C Carbonic anhydrase II (CA-II) Carbonic anhydrase II (hCA II) | Carbonic anhydrase isoenzyme II (hCA II)
Type:
Enzyme
Mol. Mass.:
29250.71
Organism:
Homo sapiens (Human)
Description:
P00918
Residue:
260
  
Inhibitor
Name:
BDBM50259373
Synonyms:
CHEMBL507085 | tert-Butyl2-((3-(4-benzoyl-5-phenyl-3-(5-sulfamoyl-1,3,4-thiadiazol-2-ylcarbamoyl)-1H-pyrazol-1-yl)phenyl)diazenyl)-3-oxobutanoate
Type:
Small organic molecule
Emp. Form.:
C33H30N8O7S2
Mol. Mass.:
714.771
SMILES:
CC(=O)C(=NNc1cccc(c1)-n1nc(C(=O)Nc2nnc(s2)S(N)(=O)=O)c(C(=O)c2ccccc2)c1-c1ccccc1)C(=O)OC(C)(C)C
: