Target
Stearoyl-CoA desaturase
Ligand
BDBM50259176
Substrate
Meas. Tech.
ChEMBL_499367 (CHEMBL1015819)
IC50
79±n/a nM
Citation
 Koltun, DOVasilevich, NIParkhill, EQGlushkov, AIZilbershtein, TMMayboroda, EIBoze, MACole, AGHenderson, IZautke, NABrunn, SAChu, NHao, JMollova, NLeung, KChisholm, JWZablocki, J Orally bioavailable, liver-selective stearoyl-CoA desaturase (SCD) inhibitors. Bioorg Med Chem Lett 19:3050-3 (2009)  
Target
Name:
Stearoyl-CoA desaturase
Synonyms:
Acyl-CoA desaturase SCD SCDOS Stearoyl-CoA (SCD1) | Stearoyl-CoA desaturase 1
Type:
Enzyme
Mol. Mass.:
41537.27
Organism:
Homo sapiens (Human)
Description:
O00767
Residue:
359
  
Inhibitor
Name:
BDBM50259176
Synonyms:
CHEMBL466257 | N-(3-(4-chlorobenzyl)-4-oxo-3,4-dihydroquinazolin-6-yl)-2-hydroxyacetamide
Type:
Small organic molecule
Emp. Form.:
C17H14ClN3O3
Mol. Mass.:
343.764
SMILES:
OCC(=O)Nc1ccc2ncn(Cc3ccc(Cl)cc3)c(=O)c2c1
: