Target
Acyl-CoA 6-desaturase
Ligand
BDBM50259087
Substrate
Meas. Tech.
ChEMBL_499369 (CHEMBL1015821)
IC50
>30000±n/a nM
Citation
 Koltun, DOVasilevich, NIParkhill, EQGlushkov, AIZilbershtein, TMMayboroda, EIBoze, MACole, AGHenderson, IZautke, NABrunn, SAChu, NHao, JMollova, NLeung, KChisholm, JWZablocki, J Orally bioavailable, liver-selective stearoyl-CoA desaturase (SCD) inhibitors. Bioorg Med Chem Lett 19:3050-3 (2009)  
Target
Name:
Acyl-CoA 6-desaturase
Synonyms:
FADS2_MOUSE Fadsd2 | Fatty acid desaturase 2
Type:
PROTEIN
Mol. Mass.:
52406.94
Organism:
Mus musculus
Description:
ChEMBL_499369
Residue:
444
  
Inhibitor
Name:
BDBM50259087
Synonyms:
CHEMBL467716 | benzyl 3-(3,4-dichlorobenzylcarbamoyl)-4-(pyridin-3-yloxy)phenylcarbamate
Type:
Small organic molecule
Emp. Form.:
C27H21Cl2N3O4
Mol. Mass.:
522.379
SMILES:
Clc1ccc(CNC(=O)c2cc(NC(=O)OCc3ccccc3)ccc2Oc2cccnc2)cc1Cl
: