Target
DNA topoisomerase 1
Ligand
BDBM50249675
Substrate
Meas. Tech.
ChEMBL_498348 (CHEMBL1020203)
EC50
210±n/a nM
Citation
 Sunami, SNishimura, TNishimura, IIto, SArakawa, HOhkubo, M Synthesis and biological activities of topoisomerase I inhibitors, 6-arylmethylamino analogues of edotecarin. J Med Chem 52:3225-37 (2009)  
Target
Name:
DNA topoisomerase 1
Synonyms:
DNA topoisomerase I Top-1 | Top1
Type:
PROTEIN
Mol. Mass.:
90922.04
Organism:
Mus musculus
Description:
ChEMBL_208411
Residue:
767
  
Inhibitor
Name:
BDBM50249675
Synonyms:
2,10-Dihydroxy-6-[(pyrazin-2-ylmethyl)amino]-13-(beta-D-glucopyranosyl)-12,13-dihydro-5H-indolo[2,3-a]pyrrolo[3,4-c]carbazole-5,7(6H)-dione | CHEMBL506902
Type:
Small organic molecule
Emp. Form.:
C31H26N6O10
Mol. Mass.:
642.5723
SMILES:
OC[C@H]1O[C@@H](On2c3cc(O)ccc3c3c4C(=O)N(NCc5cnccn5)C(=O)c4c4c5ccc(O)cc5[nH]c4c23)[C@H](O)[C@@H](O)[C@@H]1O
: