Target
Bile acid receptor
Ligand
BDBM50258744
Substrate
Meas. Tech.
ChEMBL_500797 (CHEMBL974378)
EC50
1100±n/a nM
Citation
 Bass, JYCaldwell, RDCaravella, JAChen, LCreech, KLDeaton, DNMadauss, KPMarr, HBMcFadyen, RBMiller, ABParks, DJTodd, DWilliams, SPWisely, GB Substituted isoxazole analogs of farnesoid X receptor (FXR) agonist GW4064. Bioorg Med Chem Lett 19:2969-73 (2009)  
Target
Name:
Bile acid receptor
Synonyms:
BAR FXR HRR1 NR1H4_HUMAN RIP14 Retinoid X receptor-interacting protein 14 | farnesoid x receptor
Type:
Nuclear Receptor
Mol. Mass.:
55916.24
Organism:
Homo sapiens (Human)
Description:
Q96RI1
Residue:
486
  
Inhibitor
Name:
BDBM50258744
Synonyms:
3-(2-chloro-4-((5-isopropyl-3-(phenoxymethyl)isoxazol-4-yl)methoxy)styryl)benzoic acid | CHEMBL466248
Type:
Small organic molecule
Emp. Form.:
C29H26ClNO5
Mol. Mass.:
503.973
SMILES:
CC(C)c1onc(COc2ccccc2)c1COc1ccc(\C=C\c2cccc(c2)C(O)=O)c(Cl)c1
: