Target
Bile acid receptor
Ligand
BDBM30335
Substrate
Meas. Tech.
ChEMBL_500794 (CHEMBL974375)
EC50
52±n/a nM
Citation
 Bass, JYCaldwell, RDCaravella, JAChen, LCreech, KLDeaton, DNMadauss, KPMarr, HBMcFadyen, RBMiller, ABParks, DJTodd, DWilliams, SPWisely, GB Substituted isoxazole analogs of farnesoid X receptor (FXR) agonist GW4064. Bioorg Med Chem Lett 19:2969-73 (2009)  
Target
Name:
Bile acid receptor
Synonyms:
BAR FXR HRR1 NR1H4_HUMAN RIP14 Retinoid X receptor-interacting protein 14 | farnesoid x receptor
Type:
Nuclear Receptor
Mol. Mass.:
55916.24
Organism:
Homo sapiens (Human)
Description:
Q96RI1
Residue:
486
  
Inhibitor
Name:
BDBM30335
Synonyms:
3-aryl isoxazole analog, 6d | CHEMBL469135
Type:
Small organic molecule
Emp. Form.:
C27H21Cl3N2O4
Mol. Mass.:
543.826
SMILES:
CC(C)c1onc(c1COc1ccc(\C=C\c2cccc(c2)C(O)=O)c(Cl)c1)-c1c(Cl)cncc1Cl
: