Target
Disintegrin and metalloproteinase domain-containing protein 17
Ligand
BDBM50279256
Substrate
Meas. Tech.
ChEMBL_545894 (CHEMBL1035210)
IC50
140±n/a nM
Citation
 Park, KGopalsamy, AAplasca, AEllingboe, JWXu, WZhang, YLevin, JI Synthesis and activity of tryptophan sulfonamide derivatives as novel non-hydroxamate TNF-alpha converting enzyme (TACE) inhibitors. Bioorg Med Chem 17:3857-65 (2009)  
Target
Name:
Disintegrin and metalloproteinase domain-containing protein 17
Synonyms:
ADA17_HUMAN CSVP Disintegrin and metalloproteinase domain-containing protein 17 (ADAM17) TNF-alpha convertase TNF-alpha-converting enzyme (TACE) Tumor necrosis factor-α converting enzyme (TACE)
Type:
Enzyme
Mol. Mass.:
93007.89
Organism:
Homo sapiens (Human)
Description:
Residue:
824
  
Inhibitor
Name:
BDBM50279256
Synonyms:
CHEMBL527018 N-{[4-(but-2-yn-1-yloxy)phenyl]sulfonyl}-5-methyl-D-tryptophan
Type:
Small organic molecule
Emp. Form.:
C22H22N2O5S
Mol. Mass.:
426.485
SMILES:
CC#CCOc1ccc(cc1)S(=O)(=O)N[C@H](Cc1c[nH]c2ccc(C)cc12)C(O)=O
: