Target
Proto-oncogene tyrosine-protein kinase Src
Ligand
BDBM50258287
Substrate
Meas. Tech.
ChEMBL_500034 (CHEMBL1025482)
Ki
>4000±n/a nM
Citation
 Grey, RPierce, ACBemis, GWJacobs, MDMoody, CSJajoo, RMohal, NGreen, J Structure-based design of 3-aryl-6-amino-triazolo[4,3-b]pyridazine inhibitors of Pim-1 kinase. Bioorg Med Chem Lett 19:3019-22 (2009)  
Target
Name:
Proto-oncogene tyrosine-protein kinase Src
Synonyms:
Calmodulin/Proto-oncogene tyrosine-protein kinase Src Proto-oncogene c-Src SRC SRC_HUMAN V-src sarcoma (Schmidt-Ruppin A-2) viral oncogene homolog (avian) p60-Src | pp60c-src
Type:
Protein
Mol. Mass.:
59838.60
Organism:
Homo sapiens (Human)
Description:
P12931
Residue:
536
  
Inhibitor
Name:
BDBM50258287
Synonyms:
CHEMBL493169 | N-(piperidin-4-yl)-3-(3-(trifluoromethyl)phenyl)-[1,2,4]triazolo[4,3-b]pyridazin-6-amine
Type:
Small organic molecule
Emp. Form.:
C17H17F3N6
Mol. Mass.:
362.3523
SMILES:
FC(F)(F)c1cccc(c1)-c1nnc2ccc(NC3CCNCC3)nn12
: