Target
Beta-carbonic anhydrase 1
Ligand
BDBM50258299
Substrate
Meas. Tech.
ChEMBL_519733 (CHEMBL938996)
Ki
9.7±n/a nM
Citation
 Güzel, OMaresca, AScozzafava, ASalman, ABalaban, ATSupuran, CT Discovery of low nanomolar and subnanomolar inhibitors of the mycobacterial beta-carbonic anhydrases Rv1284 and Rv3273. J Med Chem 52:4063-7 (2009)  
Target
Name:
Beta-carbonic anhydrase 1
Synonyms:
β-Carbonic anhydrase 1 (CA 1) MTCA1_MYCTU canA | mtcA1
Type:
Enzyme
Mol. Mass.:
18186.06
Organism:
Mycobacterium tuberculosis
Description:
The recombinant GST-mtCA1 construct was cloned, expressed, and further purified from E. coli. The purified protein was used in inhibition assays.
Residue:
163
  
Inhibitor
Name:
BDBM50258299
Synonyms:
1-({[5-(Aminosulfonyl)-3-(2,3,4,5,6-pentafluorophenyl)-1H-indol-2-yl]carbonyl}amino)-2,4,6 trimethylpyridinium perchlorate CHEMBL501294
Type:
Small organic molecule
Emp. Form.:
C23H18F5N4O3S
Mol. Mass.:
525.47
SMILES:
Cc1cc(C)[n+](NC(=O)c2[nH]c3ccc(cc3c2-c2c(F)c(F)c(F)c(F)c2F)S(N)(=O)=O)c(C)c1
: