Target
Muscarinic acetylcholine receptor M1
Ligand
BDBM50258754
Substrate
Meas. Tech.
ChEMBL_519763 (CHEMBL939026)
EC50
>30000±n/a nM
Citation
 Bridges, TMMarlo, JENiswender, CMJones, CKJadhav, SBGentry, PRPlumley, HCWeaver, CDConn, PJLindsley, CW Discovery of the first highly M5-preferring muscarinic acetylcholine receptor ligand, an M5 positive allosteric modulator derived from a series of 5-trifluoromethoxy N-benzyl isatins. J Med Chem 52:3445-8 (2009)  
Target
Name:
Muscarinic acetylcholine receptor M1
Synonyms:
ACM1_RAT Chrm-1 cholinergic receptor, muscarinic 1
Type:
Enzyme Catalytic Domain
Mol. Mass.:
51390.46
Organism:
RAT
Description:
P08482
Residue:
460
  
Inhibitor
Name:
BDBM50258754
Synonyms:
1-(2-chlorobenzyl)-5-(trifluoromethoxy)indoline-2,3-dione | CHEMBL513299
Type:
Small organic molecule
Emp. Form.:
C16H9ClF3NO3
Mol. Mass.:
355.696
SMILES:
FC(F)(F)Oc1ccc2N(Cc3ccccc3Cl)C(=O)C(=O)c2c1
: