Target
Integrin alpha-4
Ligand
BDBM50258531
Substrate
Meas. Tech.
ChEMBL_522802 (CHEMBL999755)
IC50
0.400000±n/a nM
Citation
 Lin, LSLanza, TJewell, JPLiu, PJones, CKieczykowski, GRTreonze, KSi, QManior, SKoo, GTong, XWang, JSchuelke, APivnichny, JWang, RRaab, CVincent, SDavies, PMaccoss, MMumford, RAHagmann, WK Discovery of N-{N-[(3-cyanophenyl)sulfonyl]-4(R)-cyclobutylamino-(L)-prolyl}-4-[(3',5'-dichloroisonicotinoyl) amino]-(L)-phenylalanine (MK-0668), an extremely potent and orally active antagonist of very late antigen-4. J Med Chem 52:3449-52 (2009)  
Target
Name:
Integrin alpha-4
Synonyms:
CD49 antigen-like family member D CD49d antigen ITA4_HUMAN Integrin alpha-4 Integrin alpha-IV VLA-4 integrin alpha 4 precursor | integrin alpha-4 precursor
Type:
Membrane Protein
Mol. Mass.:
114897.35
Organism:
Homo sapiens (Human)
Description:
P13612
Residue:
1032
  
Inhibitor
Name:
BDBM50258531
Synonyms:
CHEMBL507665 | N-{N-[(3,5-Dichlorophenyl)sulfonyl]-4(R)-amino-(L)-prolyl}-4-[(3',5'-dichloroisonicotinoyl)amino]-(L)-phenylalanine
Type:
Small organic molecule
Emp. Form.:
C26H23Cl4N5O6S
Mol. Mass.:
675.368
SMILES:
N[C@@H]1C[C@H](N(C1)S(=O)(=O)c1cc(Cl)cc(Cl)c1)C(=O)N[C@@H](Cc1ccc(NC(=O)c2c(Cl)cncc2Cl)cc1)C(O)=O
: