Target
Metabotropic glutamate receptor 5
Ligand
BDBM50160632
Substrate
Meas. Tech.
ChEMBL_523080 (CHEMBL1004110)
IC50
0.42±n/a nM
Citation
 Kulkarni, SSZou, MFCao, JDeschamps, JRRodriguez, ALConn, PJNewman, AH Structure-activity relationships comparing N-(6-methylpyridin-yl)-substituted aryl amides to 2-methyl-6-(substituted-arylethynyl)pyridines or 2-methyl-4-(substituted-arylethynyl)thiazoles as novel metabotropic glutamate receptor subtype 5 antagonists. J Med Chem 52:3563-75 (2009)  
Target
Name:
Metabotropic glutamate receptor 5
Synonyms:
GRM5_RAT Grm5 Mglur5 metabotropic glutamate 5/1-C metabotropic glutamate 5a
Type:
Enzyme
Mol. Mass.:
131900.14
Organism:
Rattus norvegicus (Rat)
Description:
P31424
Residue:
1203
  
Inhibitor
Name:
BDBM50160632
Synonyms:
3-(6-Methyl-pyridin-2-ylethynyl)-benzonitrile CHEMBL181483
Type:
Small organic molecule
Emp. Form.:
C15H10N2
Mol. Mass.:
218.2533
SMILES:
Cc1cccc(n1)C#Cc1cccc(c1)C#N
: