Target
Dynamin-1
Ligand
BDBM50268962
Substrate
Meas. Tech.
ChEMBL_523163 (CHEMBL997155)
IC50
10800±n/a nM
Citation
 Hill, TAGordon, CPMcGeachie, ABVenn-Brown, BOdell, LRChau, NQuan, AMariana, ASakoff, JAChircop, MRobinson, PJMcCluskey, A Inhibition of dynamin mediated endocytosis by the dynoles--synthesis and functional activity of a family of indoles. J Med Chem 52:3762-73 (2009)  
Target
Name:
Dynamin-1
Synonyms:
DNM DYN1_HUMAN | Dynamin-1
Type:
PROTEIN
Mol. Mass.:
97411.67
Organism:
Homo sapiens (Human)
Description:
ChEMBL_1458576
Residue:
864
  
Inhibitor
Name:
BDBM50268962
Synonyms:
2-Cyano-N-octyl-3-[1-(3-dimethylaminopropyl)-2-methyl-1Hindol-3-yl]-acrylamide | CHEMBL496625
Type:
Small organic molecule
Emp. Form.:
C26H38N4O
Mol. Mass.:
422.6061
SMILES:
CCCCCCCCNC(=O)C(=C\c1c(C)n(CCCN(C)C)c2ccccc12)\C#N
: