Target
Neuropeptide Y receptor type 5
Ligand
BDBM50268534
Substrate
Meas. Tech.
ChEMBL_523817 (CHEMBL1008329)
IC50
0.91±n/a nM
Citation
 Takahashi, THaga, YSakamoto, TMoriya, MOkamoto, ONonoshita, KShibata, TSuga, TTakahashi, HHirohashi, TSakuraba, AGomori, AIwaasa, HOhe, TIshihara, AIshii, YKanatani, AFukami, T Aryl urea derivatives of spiropiperidines as NPY Y5 receptor antagonists. Bioorg Med Chem Lett 19:3511-6 (2009)  
Target
Name:
Neuropeptide Y receptor type 5
Synonyms:
NPY-Y5 NPY5-R NPY5R_HUMAN NPYY5 Neuropeptide Y receptor type 5 ( NPY Y5) | Y5 receptor
Type:
Enzyme
Mol. Mass.:
50746.64
Organism:
Homo sapiens (Human)
Description:
Q15761
Residue:
445
  
Inhibitor
Name:
BDBM50268534
Synonyms:
CHEMBL521545 | N-(5-(3-chlorophenyl)pyrimidin-2-yl)-3-oxo-3H-spiro[isobenzofuran-1,4'-piperidine]-1'-carboxamide
Type:
Small organic molecule
Emp. Form.:
C23H19ClN4O3
Mol. Mass.:
434.875
SMILES:
Clc1cccc(c1)-c1cnc(NC(=O)N2CCC3(CC2)OC(=O)c2ccccc32)nc1
: