Target
Calcitonin gene-related peptide type 1 receptor
Ligand
BDBM50268482
Substrate
Meas. Tech.
ChEMBL_523854 (CHEMBL1004155)
IC50
0.063±n/a nM
Citation
 Degnan, APConway, CMDalterio, RAMacci, RMercer, SESchartman, RXu, CDubowchik, GMMacor, JE Carbamates as potent calcitonin gene-related peptide antagonists with improved solution stability. Bioorg Med Chem Lett 19:3555-8 (2009)  
Target
Name:
Calcitonin gene-related peptide type 1 receptor
Synonyms:
Adrenomedullin receptor AM1; CALCRL/RAMP2 CALRL_HUMAN CGRP type 1 receptor mRNA Calcitonin gene-related peptide (CGRP) receptor Calcitonin receptor-like receptor Human CL receptor
Type:
Enzyme Catalytic Domain
Mol. Mass.:
52980.45
Organism:
Homo sapiens (Human)
Description:
Q16602
Residue:
461
  
Inhibitor
Name:
BDBM50268482
Synonyms:
(R)-3-(7-methyl-1H-indazol-5-yl)-1-oxo-1-(4-(pyridin-4-yl)piperazin-1-yl)propan-2-yl 4-(2-oxo-1,2-dihydroquinolin-3-yl)piperidine-1-carboxylate | CHEMBL508349
Type:
Small organic molecule
Emp. Form.:
C35H37N7O4
Mol. Mass.:
619.7128
SMILES:
Cc1cc(C[C@@H](OC(=O)N2CCC(CC2)c2cc3ccccc3[nH]c2=O)C(=O)N2CCN(CC2)c2ccncc2)cc2cn[nH]c12
: