Target
Motilin receptor
Ligand
BDBM50268428
Substrate
Meas. Tech.
ChEMBL_523907 (CHEMBL1001500)
IC50
46±n/a nM
Citation
 Taka, NMatsuoka, HSato, TYoshino, HImaoka, ISato, HKotake, KKumagai, YKamei, KOzaki, KHigashida, AKuroki, T Discovery of novel motilin antagonists: Conversion of tetrapeptide leads to orally available peptidomimetics. Bioorg Med Chem Lett 19:3426-9 (2009)  
Target
Name:
Motilin receptor
Synonyms:
Type:
Mol. Mass.:
43771.25
Organism:
Oryctolagus cuniculus
Description:
Residue:
400
  
Inhibitor
Name:
BDBM50268428
Synonyms:
(S)-N-((S)-1-amino-3-(3-tert-butyl-4-hydroxyphenyl)-1-oxopropan-2-yl)-2-((S)-2-amino-3-phenylpropanamido)-3-methylbutanamide | CHEMBL496389
Type:
Small organic molecule
Emp. Form.:
C27H38N4O4
Mol. Mass.:
482.615
SMILES:
CC(C)[C@H](NC(=O)[C@@H](N)Cc1ccccc1)C(=O)N[C@@H](Cc1ccc(O)c(c1)C(C)(C)C)C(N)=O
: