Target
Motilin receptor
Ligand
BDBM50268432
Substrate
Meas. Tech.
ChEMBL_523907 (CHEMBL1001500)
IC50
4.3±n/a nM
Citation
 Taka, NMatsuoka, HSato, TYoshino, HImaoka, ISato, HKotake, KKumagai, YKamei, KOzaki, KHigashida, AKuroki, T Discovery of novel motilin antagonists: Conversion of tetrapeptide leads to orally available peptidomimetics. Bioorg Med Chem Lett 19:3426-9 (2009)  
Target
Name:
Motilin receptor
Synonyms:
Type:
Mol. Mass.:
43771.25
Organism:
Oryctolagus cuniculus
Description:
Residue:
400
  
Inhibitor
Name:
BDBM50268432
Synonyms:
(S)-N-((S)-1-amino-3-(3-tert-butyl-4-hydroxyphenyl)-1-oxopropan-2-yl)-2-((S)-2-amino-N-methyl-3-phenylpropanamido)-N,3-dimethylbutanamide | CHEMBL496190
Type:
Small organic molecule
Emp. Form.:
C29H42N4O4
Mol. Mass.:
510.6682
SMILES:
CC(C)[C@H](N(C)C(=O)[C@@H](N)Cc1ccccc1)C(=O)N(C)[C@@H](Cc1ccc(O)c(c1)C(C)(C)C)C(N)=O
: