Target
Peroxisome proliferator-activated receptor gamma
Ligand
BDBM50267991
Substrate
Meas. Tech.
ChEMBL_520073 (CHEMBL940694)
EC50
2±n/a nM
Citation
 Acton, JJAkiyama, TEChang, CHColwell, LDebenham, SDoebber, TEinstein, MLiu, KMcCann, MEMoller, DEMuise, ESTan, YThompson, JRWong, KKWu, MXu, LMeinke, PTBerger, JPWood, HB Discovery of (2R)-2-(3-{3-[(4-Methoxyphenyl)carbonyl]-2-methyl-6-(trifluoromethoxy)-1H-indol-1-yl}phenoxy)butanoic acid (MK-0533): a novel selective peroxisome proliferator-activated receptor gamma modulator for the treatment of type 2 diabetes mellitus with a reduced potential to increase plasma a J Med Chem 52:3846-54 (2009)  
Target
Name:
Peroxisome proliferator-activated receptor gamma
Synonyms:
NR1C3 PPAR-gamma PPARG_HUMAN Peroxisome proliferator-activated receptor gamma (PPAR gamma) Peroxisome proliferator-activated receptor gamma (PPARĪ³) peroxisome proliferator-activated receptor gamma isoform 2
Type:
Nuclear Receptor
Mol. Mass.:
57613.46
Organism:
Homo sapiens (Human)
Description:
P37231
Residue:
505
  
Inhibitor
Name:
BDBM50267991
Synonyms:
(R)-2-(3-(3-(4-methoxybenzoyl)-2-methyl-6-(trifluoromethoxy)-1H-indol-1-yl)phenoxy)butanoic acid | CHEMBL490029
Type:
Small organic molecule
Emp. Form.:
C28H24F3NO6
Mol. Mass.:
527.4885
SMILES:
CC[C@@H](Oc1cccc(c1)-n1c(C)c(C(=O)c2ccc(OC)cc2)c2ccc(OC(F)(F)F)cc12)C(O)=O
: