Target
Betaine--homocysteine S-methyltransferase 1
Ligand
BDBM50268079
Substrate
Meas. Tech.
ChEMBL_520155 (CHEMBL947843)
IC50
84±n/a nM
Citation
 Vanek, VBudesínský, MKabeleová, PSanda, MKozísek, MHanclová, IMládková, JBrynda, JRosenberg, IKoutmos, MGarrow, TAJirácek, J Structure-activity study of new inhibitors of human betaine-homocysteine S-methyltransferase. J Med Chem 52:3652-65 (2009)  
Target
Name:
Betaine--homocysteine S-methyltransferase 1
Synonyms:
BHMT | BHMT1_HUMAN
Type:
PROTEIN
Mol. Mass.:
45000.99
Organism:
Homo sapiens (Human)
Description:
ChEMBL_970672
Residue:
406
  
Inhibitor
Name:
BDBM50268079
Synonyms:
(RS)-5-(3-Amino-3-carboxypropylthio)-3,3-dimethylpentanoic Acid | CHEMBL443372
Type:
Small organic molecule
Emp. Form.:
C11H21NO4S
Mol. Mass.:
263.354
SMILES:
CC(C)(CCSCCC(N)C(O)=O)CC(O)=O
: