Target
Nitric oxide synthase, brain
Ligand
BDBM50013712
Substrate
Meas. Tech.
ChEMBL_545777 (CHEMBL1027672)
IC50
7200±n/a nM
Citation
 Fang, JJi, HLawton, GRXue, FRoman, LJSilverman, RB L337H mutant of rat neuronal nitric oxide synthase resembles human neuronal nitric oxide synthase toward inhibitors. J Med Chem 52:4533-7 (2009)  
Target
Name:
Nitric oxide synthase, brain
Synonyms:
Constitutive NOS NC-NOS NOS type I nNOS NOS1_HUMAN Neuronal nitric oxide synthase Nitric oxide synthase, neuronal (nNOS) bNOS | nNOS
Type:
Homodimer
Mol. Mass.:
160985.98
Organism:
Homo sapiens (Human)
Description:
P29475
Residue:
1434
  
Inhibitor
Name:
BDBM50013712
Synonyms:
2-aminopyridin CHEMBL21619 | Pyridin-2-ylamine
Type:
Small organic molecule
Emp. Form.:
C5H6N2
Mol. Mass.:
94.1145
SMILES:
Nc1ccccn1
: