Target
Angiotensin-converting enzyme
Ligand
BDBM50279944
Substrate
Meas. Tech.
ChEBML_35586
Ki
10±n/a nM
Citation
 Flynn, GABurkholder, TPHuber, EWBey, P An acyliminium ion route to Cis and Trans "Anti" phe-gly dipeptide mimetics Bioorg Med Chem Lett 1:309-312 (1991)    Article 
Target
Name:
Angiotensin-converting enzyme
Synonyms:
ACE Angiotensin converting enzyme (ACE) Angiotensin-converting enzyme, soluble form CD_antigen=CD143 DCP1 Kininase II
Type:
Enzyme
Mol. Mass.:
149709.01
Organism:
Homo sapiens (Human)
Description:
Residue:
1306
  
Inhibitor
Name:
BDBM50279944
Synonyms:
(R)-2-(2-Carboxymethyl-3-oxo-2,3,4,5-tetrahydro-1H-benzo[c]azepin-4-ylamino)-4-phenyl-butyric acid | CHEMBL107695
Type:
Small organic molecule
Emp. Form.:
C22H24N2O5
Mol. Mass.:
396.4364
SMILES:
OC(=O)CN1Cc2ccccc2CC(N[C@H](CCc2ccccc2)C(O)=O)C1=O
: