Target
Carboxypeptidase A1
Ligand
BDBM50279955
Substrate
Meas. Tech.
ChEBML_45616
Ki
112±n/a nM
Citation
 Kim, DHShin, YSKim, KB The structural feature of S1′ subsite of carboxypeptidase A Bioorg Med Chem Lett 1:317-322 (1991)    Article 
Target
Name:
Carboxypeptidase A1
Synonyms:
CBPA1_BOVIN CPA1 Carboxypeptidase A (CPA) | Carboxypeptidase A1 precursor
Type:
Enzyme
Mol. Mass.:
47073.90
Organism:
Bos taurus (bovine)
Description:
From Sigma-Aldrich Co.
Residue:
419
  
Inhibitor
Name:
BDBM50279955
Synonyms:
2-Mercaptomethyl-3-p-tolyl-propionic acid | CHEMBL111288
Type:
Small organic molecule
Emp. Form.:
C11H14O2S
Mol. Mass.:
210.293
SMILES:
Cc1ccc(CC(CS)C(O)=O)cc1
: