Target
Carboxypeptidase A1
Ligand
BDBM50279962
Substrate
Meas. Tech.
ChEBML_45615
Ki
1500±n/a nM
Citation
 Kim, DHKim, KB The function of S1′ subsite pocket of carboxypeptidase A Bioorg Med Chem Lett 1:323-326 (1991)    Article 
Target
Name:
Carboxypeptidase A1
Synonyms:
CBPA1_BOVIN CPA1 Carboxypeptidase A (CPA) | Carboxypeptidase A1 precursor
Type:
Enzyme
Mol. Mass.:
47073.90
Organism:
Bos taurus (bovine)
Description:
From Sigma-Aldrich Co.
Residue:
419
  
Inhibitor
Name:
BDBM50279962
Synonyms:
2-Mercaptomethyl-3-phenyl-pentanoic acid | CHEMBL109934
Type:
Small organic molecule
Emp. Form.:
C12H16O2S
Mol. Mass.:
224.319
SMILES:
CCC(C(CS)C(O)=O)c1ccccc1
: