Target
Polyunsaturated fatty acid 5-lipoxygenase
Ligand
BDBM50009941
Substrate
Meas. Tech.
ChEMBL_4165 (CHEMBL619232)
IC50
1200±n/a nM
Citation
 Brooks, DWAlbert, DHDyer, RDBouska, JBYoung, PRotert, GMachinist, JMCarter, GW 1-Phenyl-[2H]-tetrahydropyridazin-3-one, A-53612, a selective orally active 5-lipoxygenase inhibitor Bioorg Med Chem Lett 2:1353-1356 (1992)    Article 
Target
Name:
Polyunsaturated fatty acid 5-lipoxygenase
Synonyms:
Alox5 LOX5_RAT
Type:
PROTEIN
Mol. Mass.:
78082.31
Organism:
Rattus norvegicus
Description:
ChEMBL_1432947
Residue:
673
  
Inhibitor
Name:
BDBM50009941
Synonyms:
1-Phenyl-tetrahydro-pyridazin-3-one | CHEMBL30110
Type:
Small organic molecule
Emp. Form.:
C10H12N2O
Mol. Mass.:
176.2151
SMILES:
O=C1CCCN(N1)c1ccccc1
: