Target
Polyunsaturated fatty acid 5-lipoxygenase
Ligand
BDBM50280192
Substrate
Meas. Tech.
ChEBML_4294
IC50
1300±n/a nM
Citation
 Brooks, DWBasha, AKerdesky, FAHolms, JHRatajcyk, JDBhatia, PMoore, JLMartin, JGSchmidt, SPAlbert, DHDyer, RDYoung, PCarter, GW Structure-activity relationships of the pyridazinone series of 5-lipoxygenase inhibitors Bioorg Med Chem Lett 2:1357-1360 (1992)    Article 
Target
Name:
Polyunsaturated fatty acid 5-lipoxygenase
Synonyms:
5-LO 5-Lipoxygenase (5-LO) 5-Lipoygenase ALOX5 LOG5 | LOX5_HUMAN
Type:
Enzyme
Mol. Mass.:
77972.74
Organism:
Homo sapiens (Human)
Description:
Recombinant protein was purified from E. coli lysate. After ammonium sulfate precipitation and subsequent steps, the supernatant (S100) was used for 5-LO activity assay.
Residue:
674
  
Inhibitor
Name:
BDBM50280192
Synonyms:
1-m-Tolyl-pyrazolidin-3-one | CHEMBL26084
Type:
Small organic molecule
Emp. Form.:
C10H12N2O
Mol. Mass.:
176.2151
SMILES:
Cc1cccc(c1)N1CCC(=O)N1
: