Target
Chymotrypsinogen A
Ligand
BDBM50280216
Substrate
Meas. Tech.
ChEBML_49940
Ki
8100±n/a nM
Citation
 Simpelkamp, JJones, JB Borinic acid inhibitors as probes of the factors involved in binding at the active sites of subtilisin carlsberg and α-chymotrypsin Bioorg Med Chem Lett 2:1391-1394 (1992)    Article 
Target
Name:
Chymotrypsinogen A
Synonyms:
Alpha-chymotrypsin Chymotrypsin A Chymotrypsin A chain B Chymotrypsinogen A | alpha-Chymotrypsin (α-Chymotrypsin)
Type:
Serine protease
Mol. Mass.:
25670.88
Organism:
Bos taurus (bovine)
Description:
Residue:
245
  
Inhibitor
Name:
BDBM50280216
Synonyms:
Borinic acid derivative Phenyl butyl borinic acid
Type:
Small organic molecule
Emp. Form.:
C10H15BO
Mol. Mass.:
162.037
SMILES:
CCCCB(O)c1ccccc1
: